{"text_format":"3","workbook":"xlsx","n_sheets":7,"sheets":["Inicio TJ","Estrategia dominante","Estrategia Semidominante","Equilibrio Nash","Oculto TJ","Estrategia Maximin","Hoja1"],"not_rendered":{"images":6,"macros":1},"read":"whole","date_system":"1900"}

{"sheet":"Inicio TJ","index":0,"n_rows":31,"n_cols":11,"rows_kept":31,"merged":[[22,0,22,2],[30,10,30,11],[31,10,31,11]]}
{"$rows_empty":22}
["    Descargue la versión Kindle"]
{"$rows_empty":7}
[{"$nulls":10},"Miguel Cervantes J."]

{"sheet":"Estrategia dominante","index":1,"n_rows":27,"n_cols":8,"rows_kept":27,"hidden":true,"merged":[[1,0,1,8],[3,0,3,8],[5,4,5,7],[6,4,6,5],[6,6,6,7],[7,2,8,2],[10,5,10,7],[11,3,11,4],[11,5,11,7],[12,3,12,4],[12,5,12,7],[13,3,13,4],[13,5,13,7],[14,3,14,4],[14,5,14,7],[17,4,17,5],[18,4,18,5],[19,4,19,5],[23,2,23,3],[24,2,24,3],[25,2,25,3],[26,2,26,3]]}
[]
["TEORÍA DE JUEGOS"]
[]
["ESTRATEGIA DOMINANTE"]
[]
[{"$nulls":4},"Actor 2"]
[{"$nulls":4},{"$f":"D8","v":"Estrategia 1"},null,{"$f":"D9","v":"Estrategia 2"}]
[null,null,"Actor 1","Estrategia 1",{"v":10,"d":"10.0"},{"v":1,"d":"1.0"},{"v":5,"d":"5.0"},{"v":3,"d":"3.0"}]
[{"$nulls":3},"Estrategia 2",{"v":1,"d":"1.0"},{"v":2,"d":"2.0"},{"v":4,"d":"4.0"},{"v":4,"d":"4.0"}]
[]
[{"$nulls":5},"Reacción de la otra Empresa"]
[{"$nulls":3},{"$f":"'Oculto TJ'!C29","v":"Actor 1: Estrategia 1"},null,{"$f":"'Oculto TJ'!A30","v":"Actor 2: Estrategia 2"}]
[{"$nulls":3},{"$f":"'Oculto TJ'!C30","v":"Actor 1: Estrategia 2"},null,{"$f":"'Oculto TJ'!A31","v":"Actor 2: Estrategia 2"}]
[{"$nulls":3},{"$f":"'Oculto TJ'!C31","v":"Actor 2: Estrategia 1"},null,{"$f":"'Oculto TJ'!A32","v":"Actor 1: Estrategia 1"}]
[{"$nulls":3},{"$f":"'Oculto TJ'!C32","v":"Actor 2: Estrategia 2"},null,{"$f":"'Oculto TJ'!A33","v":"Actor 1: Estrategia 1"}]
[]
[]
[{"$nulls":4},"Resultado del juego"]
[{"$nulls":4},{"$f":"'Oculto TJ'!C37","v":"Actor 2"}]
[{"$nulls":4},{"$f":"'Oculto TJ'!D37","v":"Estrategia 2"}]
[null,null,{"$f":"'Oculto TJ'!C36","v":"Actor 1"},{"$f":"'Oculto TJ'!D36","v":"Estrategia 1"},{"$f":"'Oculto TJ'!E36","v":{"v":5,"d":"5.0"}},{"$f":"'Oculto TJ'!E37","v":{"v":3,"d":"3.0"}}]
[]
[]
[null,null,"Títulos"]
[null,null,"Resultados"]
[null,null,"Insertar datos"]
[null,null,"Valores de equilibrio"]

{"sheet":"Estrategia Semidominante","index":2,"n_rows":27,"n_cols":8,"rows_kept":27,"hidden":true,"merged":[[1,0,1,8],[3,0,3,8],[5,4,5,7],[6,4,6,5],[6,6,6,7],[7,2,8,2],[10,5,10,7],[11,3,11,4],[11,5,11,7],[12,3,12,4],[12,5,12,7],[13,3,13,4],[13,5,13,7],[14,3,14,4],[14,5,14,7],[17,4,17,5],[18,4,18,5],[19,4,19,5],[23,2,23,3],[24,2,24,3],[25,2,25,3],[26,2,26,3]]}
[]
["TEORÍA DE JUEGOS"]
[]
["ESTRATEGIA SEMIDOMINANTE"]
[]
[{"$nulls":4},"Actor 2"]
[{"$nulls":4},{"$f":"D8","v":"Estrategia 1"},null,{"$f":"D9","v":"Estrategia 2"}]
[null,null,"Actor 1","Estrategia 1",{"v":0,"d":"0.0"},{"v":5,"d":"5.0"},{"v":2,"d":"2.0"},{"v":1,"d":"1.0"}]
[{"$nulls":3},"Estrategia 2",{"v":1,"d":"1.0"},{"v":4,"d":"4.0"},{"v":3,"d":"3.0"},{"v":2,"d":"2.0"}]
[]
[{"$nulls":5},"Reacción del otro actor "]
[{"$nulls":3},{"$f":"'Oculto TJ'!C29","v":"Actor 1: Estrategia 1"},null,{"$f":"'Oculto TJ'!A48","v":"Actor 2: Estrategia 1"}]
[{"$nulls":3},{"$f":"'Oculto TJ'!C30","v":"Actor 1: Estrategia 2"},null,{"$f":"'Oculto TJ'!A49","v":"Actor 2: Estrategia 1"}]
[{"$nulls":3},{"$f":"'Oculto TJ'!C31","v":"Actor 2: Estrategia 1"},null,{"$f":"'Oculto TJ'!A50","v":"Actor 1: Estrategia 2"}]
[{"$nulls":3},{"$f":"'Oculto TJ'!C32","v":"Actor 2: Estrategia 2"},null,{"$f":"'Oculto TJ'!A51","v":"Actor 1: Estrategia 2"}]
[]
[]
[{"$nulls":4},"Resultado del juego"]
[{"$nulls":4},{"$f":"'Oculto TJ'!C37","v":"Actor 2"}]
[{"$nulls":4},{"$f":"'Oculto TJ'!D66","v":"Estrategia 1"}]
[null,null,{"$f":"'Oculto TJ'!C36","v":"Actor 1"},{"$f":"'Oculto TJ'!D65","v":"Estrategia 2"},{"$f":"'Oculto TJ'!E65","v":{"v":1,"d":"1.0"}},{"$f":"'Oculto TJ'!E66","v":{"v":4,"d":"4.0"}}]
[]
[]
[null,null,"Títulos"]
[null,null,"Resultados"]
[null,null,"Insertar datos"]
[null,null,"Valores de equilibrio"]

{"sheet":"Equilibrio Nash","index":3,"n_rows":35,"n_cols":8,"rows_kept":35,"hidden":true,"merged":[[1,0,1,8],[3,0,3,8],[5,4,5,7],[6,4,6,5],[6,6,6,7],[7,2,8,2],[10,5,10,7],[11,3,11,4],[11,5,11,7],[12,3,12,4],[12,5,12,7],[13,3,13,4],[13,5,13,7],[14,3,14,4],[14,5,14,7],[16,2,16,3],[16,4,16,5],[18,4,18,5],[19,4,19,5],[20,4,20,5],[23,2,23,7],[25,4,25,5],[26,4,26,5],[27,4,27,5],[31,2,31,3],[32,2,32,3],[33,2,33,3],[34,2,34,3]]}
[]
["TEORÍA DE JUEGOS"]
[]
["EQUILIBRIO DE NASH"]
[]
[{"$nulls":4},"Actor 2"]
[{"$nulls":4},{"$f":"D8","v":"Estrategia 1"},null,{"$f":"D9","v":"Estrategia 2"}]
[null,null,"Actor 1","Estrategia 1",{"v":10,"d":"10.0"},{"v":1,"d":"1.0"},{"v":1,"d":"1.0"},{"v":5,"d":"5.0"}]
[{"$nulls":3},"Estrategia 2",{"v":10,"d":"10.0"},{"v":1,"d":"1.0"},{"v":2,"d":"2.0"},{"v":1,"d":"1.0"}]
[]
[{"$nulls":5},"Reacción de la otra Empresa"]
[{"$nulls":3},{"$f":"'Oculto TJ'!C29","v":"Actor 1: Estrategia 1"},null,{"$f":"'Oculto TJ'!A84","v":"Actor 2: Estrategia 2"}]
[{"$nulls":3},{"$f":"'Oculto TJ'!C30","v":"Actor 1: Estrategia 2"},null,{"$f":"'Oculto TJ'!A85","v":"Actor 2: Indefinido"}]
[{"$nulls":3},{"$f":"'Oculto TJ'!C31","v":"Actor 2: Estrategia 1"},null,{"$f":"'Oculto TJ'!A86","v":"Actor 1: Indefinido"}]
[{"$nulls":3},{"$f":"'Oculto TJ'!C32","v":"Actor 2: Estrategia 2"},null,{"$f":"'Oculto TJ'!A87","v":"Actor 1: Estrategia 2"}]
[]
[null,null,"TIPO DE SOLUCIÒN",null,{"$f":"'Oculto TJ'!C116","v":"NASH"}]
[]
[{"$nulls":4},"Resultado del juego"]
[{"$nulls":4},{"$f":"'Oculto TJ'!C37","v":"Actor 2"}]
[{"$nulls":4},{"$f":"'Oculto TJ'!D121","v":"Estrategia 1"}]
[null,null,{"$f":"'Oculto TJ'!C36","v":"Actor 1"},{"$f":"'Oculto TJ'!C122","v":"Estrategia 1"},{"$f":"'Oculto TJ'!D122","v":{"v":10,"d":"10.0"}},{"$f":"'Oculto TJ'!E122","v":{"v":1,"d":"1.0"}}]
[]
[null,null,"SI EL JUEGO SE RESUELVE POR EQUILIBRIO DE NASH, EL OTRO RESULTADO ES:"]
[]
[{"$nulls":4},"Resultado del juego"]
[{"$nulls":4},{"$f":"E20","v":"Actor 2"}]
[{"$nulls":4},{"$f":"'Oculto TJ'!I121","v":"Estrategia 2"}]
[null,null,{"$f":"C22","v":"Actor 1"},{"$f":"'Oculto TJ'!H122","v":"Estrategia 2"},{"$f":"'Oculto TJ'!I122","v":{"v":2,"d":"2.0"}},{"$f":"'Oculto TJ'!J122","v":{"v":1,"d":"1.0"}}]
[]
[]
[null,null,"Títulos"]
[null,null,"Resultados"]
[null,null,"Insertar datos"]
[null,null,"Valores de equilibrio"]

{"sheet":"Oculto TJ","index":4,"n_rows":122,"n_cols":60,"rows_kept":122,"hidden":true,"merged":[[2,2,2,5],[3,2,3,3],[3,4,3,5],[4,0,5,0],[4,7,5,7],[20,0,20,12],[38,0,38,12],[41,2,41,3],[41,4,41,5],[74,0,74,12],[77,2,77,3],[77,4,77,5],[107,2,107,4],[111,2,111,4],[119,1,120,2],[119,3,119,4],[119,6,120,7],[119,8,119,9]]}
["TEORÍA DE JUEGOS"]
[{"$nulls":23},"ORIGINAL",{"$nulls":6},"MENOS 2",{"$nulls":6},"MENOS 1",{"$nulls":7},"MAS 1",{"$nulls":6},"MAS 2",{"$nulls":6},"DOTACIÓN"]
[null,null,"Agente 2"]
[null,null,"Confiesa",null,"No Confiesa"]
["Agente 1","Confiesa",-5,-5,0,-20,null,"Empresa 1",{"$nulls":7},"LA ESTRATEGIA MAXIMIN"]
[null,"No Confiesa",-20,0,-1,-1,{"$nulls":10},"B1","B1","B2","B2","B3","B3","B4","B4","B5","B5","B6","B6","B7","B7","B8","B8","B9","B9","Mínimo de A"]
[{"$nulls":15},"A1",{"$f":"'Estrategia Maximin'!C7","v":10},{"$f":"'Estrategia Maximin'!D7","v":6},{"$f":"'Estrategia Maximin'!E7","v":10},{"$f":"'Estrategia Maximin'!F7","v":10},{"$f":"'Estrategia Maximin'!G7","v":0},{"$f":"'Estrategia Maximin'!H7","v":0},{"$f":"'Estrategia Maximin'!I7","v":0},{"$f":"'Estrategia Maximin'!J7","v":0},{"$f":"'Estrategia Maximin'!K7","v":0},{"$f":"'Estrategia Maximin'!L7","v":0},{"$f":"'Estrategia Maximin'!M7","v":0},{"$f":"'Estrategia Maximin'!N7","v":0},{"$f":"'Estrategia Maximin'!O7","v":0},{"$f":"'Estrategia Maximin'!P7","v":0},{"$f":"'Estrategia Maximin'!Q7","v":0},{"$f":"'Estrategia Maximin'!R7","v":0},{"$f":"'Estrategia Maximin'!S7","v":0},{"$f":"'Estrategia Maximin'!T7","v":0},{"$f":"MIN(Q7,S7,U7,W7,Y7,AA7,AC7,AE7,AG7)","v":0}]
[{"$nulls":4},"Reacción",{"$nulls":10},"A2",{"$f":"'Estrategia Maximin'!C8","v":6},{"$f":"'Estrategia Maximin'!D8","v":6},{"$f":"'Estrategia Maximin'!E8","v":6},{"$f":"'Estrategia Maximin'!F8","v":10},{"$f":"'Estrategia Maximin'!G8","v":0},{"$f":"'Estrategia Maximin'!H8","v":0},{"$f":"'Estrategia Maximin'!I8","v":0},{"$f":"'Estrategia Maximin'!J8","v":0},{"$f":"'Estrategia Maximin'!K8","v":0},{"$f":"'Estrategia Maximin'!L8","v":0},{"$f":"'Estrategia Maximin'!M8","v":0},{"$f":"'Estrategia Maximin'!N8","v":0},{"$f":"'Estrategia Maximin'!O8","v":0},{"$f":"'Estrategia Maximin'!P8","v":0},{"$f":"'Estrategia Maximin'!Q8","v":0},{"$f":"'Estrategia Maximin'!R8","v":0},{"$f":"'Estrategia Maximin'!S8","v":0},{"$f":"'Estrategia Maximin'!T8","v":0},{"$f":"MIN(Q8,S8,U8,W8,Y8,AA8,AC8,AE8,AG8)","v":0}]
[null,null,"Agente 1: Confiesa",null,{"$f":"IF(D5>F5,C4,E4)","v":"Confiesa"},null,{"$f":"IF(D5>F5,D5,F5)","v":-5},{"$nulls":8},"A3",{"$f":"'Estrategia Maximin'!C9","v":0},{"$f":"'Estrategia Maximin'!D9","v":0},{"$f":"'Estrategia Maximin'!E9","v":0},{"$f":"'Estrategia Maximin'!F9","v":0},{"$f":"'Estrategia Maximin'!G9","v":0},{"$f":"'Estrategia Maximin'!H9","v":0},{"$f":"'Estrategia Maximin'!I9","v":0},{"$f":"'Estrategia Maximin'!J9","v":0},{"$f":"'Estrategia Maximin'!K9","v":0},{"$f":"'Estrategia Maximin'!L9","v":0},{"$f":"'Estrategia Maximin'!M9","v":0},{"$f":"'Estrategia Maximin'!N9","v":0},{"$f":"'Estrategia Maximin'!O9","v":0},{"$f":"'Estrategia Maximin'!P9","v":0},{"$f":"'Estrategia Maximin'!Q9","v":0},{"$f":"'Estrategia Maximin'!R9","v":0},{"$f":"'Estrategia Maximin'!S9","v":0},{"$f":"'Estrategia Maximin'!T9","v":0},0]
[null,null,"Agente 1: No Confiesa",null,{"$f":"IF(D6>F6,C4,E4)","v":"Confiesa"},{"$f":"IF(E9=E10,E9,E10)","v":"Confiesa"},{"$f":"IF(D6>F6,D6,F6)","v":0},{"$f":"IF(G9>G10,G10,G9)","v":-5},{"$nulls":7},"A4",{"$f":"'Estrategia Maximin'!C10","v":0},{"$f":"'Estrategia Maximin'!D10","v":0},{"$f":"'Estrategia Maximin'!E10","v":0},{"$f":"'Estrategia Maximin'!F10","v":0},{"$f":"'Estrategia Maximin'!G10","v":0},{"$f":"'Estrategia Maximin'!H10","v":0},{"$f":"'Estrategia Maximin'!I10","v":0},{"$f":"'Estrategia Maximin'!J10","v":0},{"$f":"'Estrategia Maximin'!K10","v":0},{"$f":"'Estrategia Maximin'!L10","v":0},{"$f":"'Estrategia Maximin'!M10","v":0},{"$f":"'Estrategia Maximin'!N10","v":0},{"$f":"'Estrategia Maximin'!O10","v":0},{"$f":"'Estrategia Maximin'!P10","v":0},{"$f":"'Estrategia Maximin'!Q10","v":0},{"$f":"'Estrategia Maximin'!R10","v":0},{"$f":"'Estrategia Maximin'!S10","v":0},{"$f":"'Estrategia Maximin'!T10","v":0},0]
[null,null,"Agente 2: Confiesa",null,{"$f":"IF(C5>C6,B5,B6)","v":"Confiesa"},null,{"$f":"IF(C5>C6,C5,C6)","v":-5},{"$nulls":8},"A4",{"$f":"'Estrategia Maximin'!C11","v":0},{"$f":"'Estrategia Maximin'!D11","v":0},{"$f":"'Estrategia Maximin'!E11","v":0},{"$f":"'Estrategia Maximin'!F11","v":0},{"$f":"'Estrategia Maximin'!G11","v":0},{"$f":"'Estrategia Maximin'!H11","v":0},{"$f":"'Estrategia Maximin'!I11","v":0},{"$f":"'Estrategia Maximin'!J11","v":0},{"$f":"'Estrategia Maximin'!K11","v":0},{"$f":"'Estrategia Maximin'!L11","v":0},{"$f":"'Estrategia Maximin'!M11","v":0},{"$f":"'Estrategia Maximin'!N11","v":0},{"$f":"'Estrategia Maximin'!O11","v":0},{"$f":"'Estrategia Maximin'!P11","v":0},{"$f":"'Estrategia Maximin'!Q11","v":0},{"$f":"'Estrategia Maximin'!R11","v":0},{"$f":"'Estrategia Maximin'!S11","v":0},{"$f":"'Estrategia Maximin'!T11","v":0},0]
[null,null,"Agente 2: No Confiesa",null,{"$f":"IF(E5>E6,B5,B6)","v":"Confiesa"},{"$f":"IF(E11=E12,E11,E12)","v":"Confiesa"},{"$f":"IF(E5>E6,E5,E6)","v":0},{"$f":"IF(G11>G12,G12,G11)","v":-5},{"$nulls":7},"A6",{"$f":"'Estrategia Maximin'!C12","v":0},{"$f":"'Estrategia Maximin'!D12","v":0},{"$f":"'Estrategia Maximin'!E12","v":0},{"$f":"'Estrategia Maximin'!F12","v":0},{"$f":"'Estrategia Maximin'!G12","v":0},{"$f":"'Estrategia Maximin'!H12","v":0},{"$f":"'Estrategia Maximin'!I12","v":0},{"$f":"'Estrategia Maximin'!J12","v":0},{"$f":"'Estrategia Maximin'!K12","v":0},{"$f":"'Estrategia Maximin'!L12","v":0},{"$f":"'Estrategia Maximin'!M12","v":0},{"$f":"'Estrategia Maximin'!N12","v":0},{"$f":"'Estrategia Maximin'!O12","v":0},{"$f":"'Estrategia Maximin'!P12","v":0},{"$f":"'Estrategia Maximin'!Q12","v":0},{"$f":"'Estrategia Maximin'!R12","v":0},{"$f":"'Estrategia Maximin'!S12","v":0},{"$f":"'Estrategia Maximin'!T12","v":0},0]
[{"$nulls":15},"A7",{"$f":"'Estrategia Maximin'!C13","v":0},{"$f":"'Estrategia Maximin'!D13","v":0},{"$f":"'Estrategia Maximin'!E13","v":0},{"$f":"'Estrategia Maximin'!F13","v":0},{"$f":"'Estrategia Maximin'!G13","v":0},{"$f":"'Estrategia Maximin'!H13","v":0},{"$f":"'Estrategia Maximin'!I13","v":0},{"$f":"'Estrategia Maximin'!J13","v":0},{"$f":"'Estrategia Maximin'!K13","v":0},{"$f":"'Estrategia Maximin'!L13","v":0},{"$f":"'Estrategia Maximin'!M13","v":0},{"$f":"'Estrategia Maximin'!N13","v":0},{"$f":"'Estrategia Maximin'!O13","v":0},{"$f":"'Estrategia Maximin'!P13","v":0},{"$f":"'Estrategia Maximin'!Q13","v":0},{"$f":"'Estrategia Maximin'!R13","v":0},{"$f":"'Estrategia Maximin'!S13","v":0},{"$f":"'Estrategia Maximin'!T13","v":0},0]
[null,null,"Resultado del juego",{"$nulls":12},"A8",{"$f":"'Estrategia Maximin'!C14","v":0},{"$f":"'Estrategia Maximin'!D14","v":0},{"$f":"'Estrategia Maximin'!E14","v":0},{"$f":"'Estrategia Maximin'!F14","v":0},{"$f":"'Estrategia Maximin'!G14","v":0},{"$f":"'Estrategia Maximin'!H14","v":0},{"$f":"'Estrategia Maximin'!I14","v":0},{"$f":"'Estrategia Maximin'!J14","v":0},{"$f":"'Estrategia Maximin'!K14","v":0},{"$f":"'Estrategia Maximin'!L14","v":0},{"$f":"'Estrategia Maximin'!M14","v":0},{"$f":"'Estrategia Maximin'!N14","v":0},{"$f":"'Estrategia Maximin'!O14","v":0},{"$f":"'Estrategia Maximin'!P14","v":0},{"$f":"'Estrategia Maximin'!Q14","v":0},{"$f":"'Estrategia Maximin'!R14","v":0},{"$f":"'Estrategia Maximin'!S14","v":0},{"$f":"'Estrategia Maximin'!T14","v":0},0]
[{"$nulls":3},"Acción ","Pago",{"$nulls":10},"A9",{"$f":"'Estrategia Maximin'!C15","v":0},{"$f":"'Estrategia Maximin'!D15","v":0},{"$f":"'Estrategia Maximin'!E15","v":0},{"$f":"'Estrategia Maximin'!F15","v":0},{"$f":"'Estrategia Maximin'!G15","v":0},{"$f":"'Estrategia Maximin'!H15","v":0},{"$f":"'Estrategia Maximin'!I15","v":0},{"$f":"'Estrategia Maximin'!J15","v":0},{"$f":"'Estrategia Maximin'!K15","v":0},{"$f":"'Estrategia Maximin'!L15","v":0},{"$f":"'Estrategia Maximin'!M15","v":0},{"$f":"'Estrategia Maximin'!N15","v":0},{"$f":"'Estrategia Maximin'!O15","v":0},{"$f":"'Estrategia Maximin'!P15","v":0},{"$f":"'Estrategia Maximin'!Q15","v":0},{"$f":"'Estrategia Maximin'!R15","v":0},{"$f":"'Estrategia Maximin'!S15","v":0},{"$f":"'Estrategia Maximin'!T15","v":0},0]
[null,null,"Agente 1",{"$f":"F10","v":"Confiesa"},{"$f":"H12","v":-5},{"$nulls":10},"Mínimo B",null,{"$f":"MIN(R7:R15)","v":0},null,{"$f":"MIN(T7:T15)","v":0},null,{"$f":"MIN(V7:V15)","v":0},null,{"$f":"MIN(X7:X15)","v":0},null,{"$f":"MIN(Z7:Z15)","v":0},null,{"$f":"MIN(AB7:AB15)","v":0},null,{"$f":"MIN(AD7:AD15)","v":0},null,{"$f":"MIN(AF7:AF15)","v":0},null,{"$f":"MIN(AH7:AH15)","v":0}]
[null,null,"Agente 2",{"$f":"F12","v":"Confiesa"},{"$f":"H10","v":-5}]
[{"$nulls":19},"máximo A","máximo B"]
[{"$nulls":19},{"$f":"MAX(AI7:AI15)","v":0},{"$f":"MAX(Q16:AH16)","v":0}]
[]
["DOMINANTE"]
[]
[null,null,{"$f":"'Estrategia dominante'!E6","v":"Actor 2"}]
[null,null,{"$f":"'Estrategia dominante'!E7","v":"Estrategia 1"},{"$f":"C24","v":"Estrategia 1"},{"$f":"'Estrategia dominante'!G7","v":"Estrategia 2"},{"$f":"E24","v":"Estrategia 2"}]
[{"$f":"'Estrategia dominante'!C8","v":"Actor 1"},{"$f":"'Estrategia dominante'!D8","v":"Estrategia 1"},{"$f":"'Estrategia dominante'!E8","v":10},{"$f":"'Estrategia dominante'!F8","v":1},{"$f":"'Estrategia dominante'!G8","v":5},{"$f":"'Estrategia dominante'!H8","v":3}]
[null,{"$f":"'Estrategia dominante'!D9","v":"Estrategia 2"},{"$f":"'Estrategia dominante'!E9","v":1},{"$f":"'Estrategia dominante'!F9","v":2},{"$f":"'Estrategia dominante'!G9","v":4},{"$f":"'Estrategia dominante'!H9","v":4},{"$nulls":4},"E1","E2"]
[null,": ",{"$nulls":7},{"$f":"\"Estrategia 1\"&\"Estrategia 1\"","v":"Estrategia 1Estrategia 1"},{"$f":"C25","v":10},{"$f":"D25","v":1}]
[{"$nulls":4},"Reacción de la otra Empresa",{"$nulls":4},{"$f":"\"Estrategia 2\"&\"Estrategia 1\"","v":"Estrategia 2Estrategia 1"},{"$f":"C26","v":1},{"$f":"D26","v":2}]
[null,null,{"$f":"CONCATENATE(A25,B27,B25)","v":"Actor 1: Estrategia 1"},null,{"$f":"IF(D25=F25,\"Indefinido\",IF(G29=F25,E24,C24))","v":"Estrategia 2"},null,{"$f":"MAX(F25,D25)","v":3},null,null,{"$f":"\"Estrategia 1\"&\"Estrategia 2\"","v":"Estrategia 1Estrategia 2"},{"$f":"E25","v":5},{"$f":"F25","v":3}]
[{"$f":"CONCATENATE(C23,$B$27,E29)","v":"Actor 2: Estrategia 2"},null,{"$f":"CONCATENATE(A25,B27,B26)","v":"Actor 1: Estrategia 2"},null,{"$f":"IF(D26=F26,\"Indefinido\",IF(G30=F26,E24,C24))","v":"Estrategia 2"},{"$f":"IF(E30=E29,E29,\"Indefinido\")","v":"Estrategia 2"},{"$f":"MAX(F26,D26)","v":4},{"$f":"IF(F30=F32,G30,G29)","v":3},null,{"$f":"\"Estrategia 2\"&\"Estrategia 2\"","v":"Estrategia 2Estrategia 2"},{"$f":"E26","v":4},{"$f":"F26","v":4}]
[{"$f":"CONCATENATE(C23,$B$27,E30)","v":"Actor 2: Estrategia 2"},null,{"$f":"CONCATENATE(C23,B27,C24)","v":"Actor 2: Estrategia 1"},null,{"$f":"IF(C25=C26,\"Indefinido\",IF(G31=C26,B26,B25))","v":"Estrategia 1"},null,{"$f":"MAX(C25:C26)","v":10},null,null,{"$f":"\"INDEFINIDO\"&\"Estrategia 1\"","v":"INDEFINIDOEstrategia 1"},"Indefinido","Indefinido"]
[{"$f":"CONCATENATE(A25,$B$27,E31)","v":"Actor 1: Estrategia 1"},null,{"$f":"CONCATENATE(C23,B27,E24)","v":"Actor 2: Estrategia 2"},null,{"$f":"IF(E25=E26,\"Indefinido\",IF(G32=E26,B26,B25))","v":"Estrategia 1"},{"$f":"IF(E32=E31,E31,\"Indefinido\")","v":"Estrategia 1"},{"$f":"MAX(E25:E26)","v":5},{"$f":"IF(F30=F32,G32,G31)","v":10},null,{"$f":"\"Estrategia 2\"&\"INDEFINIDO\"","v":"Estrategia 2INDEFINIDO"},"Indefinido","Indefinido"]
[{"$f":"CONCATENATE(A25,$B$27,E32)","v":"Actor 1: Estrategia 1"},{"$nulls":8},{"$f":"\"INDEFINIDO\"&\"INDEFINIDO\"","v":"INDEFINIDOINDEFINIDO"},"Indefinido","Indefinido"]
[null,null,"Resultado del juego",null,null,{"$f":"D36&D37","v":"Estrategia 1Estrategia 2"},{"$nulls":3},{"$f":"\"INDEFINIDO\"&\"Estrategia 2\"","v":"INDEFINIDOEstrategia 2"},"Indefinido","Indefinido"]
[{"$nulls":3},"Acción ","Pago",{"$nulls":4},{"$f":"\"Estrategia 1\"&\"INDEFINIDO\"","v":"Estrategia 1INDEFINIDO"},"Indefinido","Indefinido"]
[null,null,{"$f":"A25","v":"Actor 1"},{"$f":"F32","v":"Estrategia 1"},{"$f":"VLOOKUP($F$34,$J$27:$L$35,2,0)","v":5}]
[null,null,{"$f":"C23","v":"Actor 2"},{"$f":"F30","v":"Estrategia 2"},{"$f":"VLOOKUP($F$34,$J$27:$L$35,3,0)","v":3}]
[]
["SEMIDOMINANTE"]
[]
[null,null,{"$f":"'Estrategia Semidominante'!E6","v":"Actor 2"}]
[null,null,{"$f":"'Estrategia Semidominante'!E7","v":"Estrategia 1"},{"$f":"'Estrategia Semidominante'!F7","v":0},{"$f":"'Estrategia Semidominante'!G7","v":"Estrategia 2"},{"$f":"'Estrategia Semidominante'!H7","v":0}]
[{"$f":"'Estrategia Semidominante'!C8","v":"Actor 1"},{"$f":"'Estrategia Semidominante'!D8","v":"Estrategia 1"},{"$f":"'Estrategia Semidominante'!E8","v":0},{"$f":"'Estrategia Semidominante'!F8","v":5},{"$f":"'Estrategia Semidominante'!G8","v":2},{"$f":"'Estrategia Semidominante'!H8","v":1}]
[null,{"$f":"'Estrategia Semidominante'!D9","v":"Estrategia 2"},{"$f":"'Estrategia Semidominante'!E9","v":1},{"$f":"'Estrategia Semidominante'!F9","v":4},{"$f":"'Estrategia Semidominante'!G9","v":3},{"$f":"'Estrategia Semidominante'!H9","v":2},{"$nulls":4},"E1","E2"]
[null,": ",{"$nulls":7},{"$f":"\"Estrategia 1\"&\"Estrategia 1\"","v":"Estrategia 1Estrategia 1"},{"$f":"C43","v":0},{"$f":"D43","v":5}]
[{"$nulls":4},"Reacción de la otra Empresa",{"$nulls":4},{"$f":"\"Estrategia 2\"&\"Estrategia 1\"","v":"Estrategia 2Estrategia 1"},{"$f":"C44","v":1},{"$f":"D44","v":4}]
[null,null,{"$f":"CONCATENATE(A43,B45,B43)","v":"Actor 1: Estrategia 1"},null,{"$f":"IF(D43=F43,\"Indefinido\",IF(G47=F43,E42,C42))","v":"Estrategia 1"},null,{"$f":"MAX(F43,D43)","v":5},null,null,{"$f":"\"Estrategia 1\"&\"Estrategia 2\"","v":"Estrategia 1Estrategia 2"},{"$f":"E43","v":2},{"$f":"F43","v":1}]
[{"$f":"CONCATENATE(C41,$B$27,E47)","v":"Actor 2: Estrategia 1"},null,{"$f":"CONCATENATE(A43,B45,B44)","v":"Actor 1: Estrategia 2"},null,{"$f":"IF(D44=F44,\"Indefinido\",IF(G48=F44,E42,C42))","v":"Estrategia 1"},{"$f":"IF(E48=E47,E47,\"Indefinido\")","v":"Estrategia 1"},{"$f":"MAX(F44,D44)","v":4},{"$f":"IF(F48=F50,G48,G47)","v":5},null,{"$f":"\"Estrategia 2\"&\"Estrategia 2\"","v":"Estrategia 2Estrategia 2"},{"$f":"E44","v":3},{"$f":"F44","v":2}]
[{"$f":"CONCATENATE(C41,$B$27,E48)","v":"Actor 2: Estrategia 1"},null,{"$f":"CONCATENATE(C41,B45,C42)","v":"Actor 2: Estrategia 1"},null,{"$f":"IF(C43=C44,\"Indefinido\",IF(G49=C44,B44,B43))","v":"Estrategia 2"},null,{"$f":"MAX(C43:C44)","v":1},null,null,{"$f":"\"INDEFINIDO\"&\"Estrategia 1\"","v":"INDEFINIDOEstrategia 1"},"Indefinido","Indefinido"]
[{"$f":"CONCATENATE(A43,$B$27,E49)","v":"Actor 1: Estrategia 2"},null,{"$f":"CONCATENATE(C41,B45,E42)","v":"Actor 2: Estrategia 2"},null,{"$f":"IF(E43=E44,\"Indefinido\",IF(G50=E44,B44,B43))","v":"Estrategia 2"},{"$f":"IF(E50=E49,E49,\"Indefinido\")","v":"Estrategia 2"},{"$f":"MAX(E43:E44)","v":3},{"$f":"IF(F48=F50,G50,G49)","v":1},null,{"$f":"\"Estrategia 2\"&\"INDEFINIDO\"","v":"Estrategia 2INDEFINIDO"},"Indefinido","Indefinido"]
[{"$f":"CONCATENATE(A43,$B$27,E50)","v":"Actor 1: Estrategia 2"},{"$nulls":8},{"$f":"\"INDEFINIDO\"&\"INDEFINIDO\"","v":"INDEFINIDOINDEFINIDO"},"Indefinido","Indefinido"]
[null,null,"Resultado del juego",null,null,{"$f":"D54&D55","v":"Estrategia 2Estrategia 1"},{"$nulls":3},{"$f":"\"INDEFINIDO\"&\"Estrategia 2\"","v":"INDEFINIDOEstrategia 2"},"Indefinido","Indefinido"]
[{"$nulls":3},"Acción ",{"$nulls":5},{"$f":"\"Estrategia 1\"&\"INDEFINIDO\"","v":"Estrategia 1INDEFINIDO"},"Indefinido","Indefinido"]
[null,null,{"$f":"A43","v":"Actor 1"},{"$f":"F50","v":"Estrategia 2"},{"$f":"VLOOKUP($F$52,$J$45:$L$53,2,0)","v":1}]
[null,null,{"$f":"C41","v":"Actor 2"},{"$f":"F48","v":"Estrategia 1"},{"$f":"VLOOKUP($F$52,$J$45:$L$53,3,0)","v":4}]
[]
[{"$nulls":4},"A1","A2",{"$nulls":3},"ACTOR 2","ACTOR 1"]
[null,null,"Actor 1",{"$f":"IF($F50=\"indefinido\",VLOOKUP($F48,$J$58:$N$60,3,0),\"error\")","v":"error"},{"$f":"VLOOKUP($F$61,$J$45:$L$53,2,0)","v":{"$error":"#N/A"}},{"$f":"VLOOKUP($F$61,$J$45:$L$53,3,0)","v":{"$error":"#N/A"}},{"$nulls":3},{"$f":"\"Estrategia 1\"","v":"Estrategia 1"},{"$f":"MAX(C43:C44)","v":1},{"$f":"IF(K58=C43,B43,B44)","v":"Estrategia 2"}]
[null,null,"Actor 2",{"$f":"IF(F48=\"indefinido\",VLOOKUP(F50,J63:N65,3,0),\"error\")","v":"error"},{"$f":"VLOOKUP($F$62,$J$45:$L$53,2,0)","v":{"$error":"#N/A"}},{"$f":"VLOOKUP($F$62,$J$45:$L$53,3,0)","v":{"$error":"#N/A"}},{"$nulls":3},{"$f":"\"Estrategia 2\"","v":"Estrategia 2"},{"$f":"MAX(E43:E44)","v":3},{"$f":"IF(K59=E43,B43,B44)","v":"Estrategia 2"}]
[{"$nulls":9},"INDEFINIDO","INDEFINIDO","INDEFINIDO"]
[{"$nulls":5},{"$f":"D58&F48","v":"errorEstrategia 1"}]
[{"$nulls":5},{"$f":"F50&D59","v":"Estrategia 2error"},{"$nulls":3},"ACTOR 1","ACTOR 2"]
[{"$nulls":9},{"$f":"\"Estrategia 1\"","v":"Estrategia 1"},{"$f":"MAX(D43,F43)","v":5},{"$f":"IF(K63=D43,C42,E42)","v":"Estrategia 1"}]
[{"$nulls":4},"A1",{"$nulls":4},{"$f":"\"Estrategia 2\"","v":"Estrategia 2"},{"$f":"MAX(D44,F44)","v":4},{"$f":"IF(K64=D44,C42,E42)","v":"Estrategia 1"}]
[null,null,"Actor 1",{"$f":"IF($F$50=\"INDEFINIDO\",$D$58,$D$54)","v":"Estrategia 2"},{"$f":"VLOOKUP($D$68,$J$45:$L$53,2,0)","v":1},{"$nulls":4},"INDEFINIDO","INDEFINIDO","INDEFINIDO"]
[null,null,"Actor 2",{"$f":"IF($F$48=\"INDEFINIDO\",$D$59,$D$55)","v":"Estrategia 1"},{"$f":"VLOOKUP($D$68,$J$45:$L$53,3,0)","v":4}]
[]
[{"$nulls":3},{"$f":"D65&D66","v":"Estrategia 2Estrategia 1"}]
[]
[{"$nulls":9},"Estrategia 1 Estrategia 1",{"$f":"E44","v":3},{"$f":"F44","v":2}]
[{"$nulls":9},"Estrategia 2 Estrategia 2",{"$f":"E43","v":2},{"$f":"F43","v":1}]
[]
[]
[]
["NIÑAS"]
[]
[null,null,{"$f":"'Equilibrio Nash'!E6","v":"Actor 2"}]
[null,null,{"$f":"'Equilibrio Nash'!E7","v":"Estrategia 1"},null,{"$f":"'Equilibrio Nash'!G7","v":"Estrategia 2"}]
[{"$f":"'Equilibrio Nash'!C8","v":"Actor 1"},{"$f":"'Equilibrio Nash'!D8","v":"Estrategia 1"},{"$f":"'Equilibrio Nash'!E8","v":10},{"$f":"'Equilibrio Nash'!F8","v":1},{"$f":"'Equilibrio Nash'!G8","v":1},{"$f":"'Equilibrio Nash'!H8","v":5}]
[null,{"$f":"'Equilibrio Nash'!D9","v":"Estrategia 2"},{"$f":"'Equilibrio Nash'!E9","v":10},{"$f":"'Equilibrio Nash'!F9","v":1},{"$f":"'Equilibrio Nash'!G9","v":2},{"$f":"'Equilibrio Nash'!H9","v":1},{"$nulls":4},"E1","E2"]
[null,": ",{"$nulls":7},{"$f":"\"Estrategia 1\"&\"Estrategia 1\"","v":"Estrategia 1Estrategia 1"},{"$f":"C79","v":10},{"$f":"D79","v":1}]
[{"$nulls":4},"Reacción de la otra Empresa",{"$nulls":4},{"$f":"\"Estrategia 2\"&\"Estrategia 1\"","v":"Estrategia 2Estrategia 1"},{"$f":"C80","v":10},{"$f":"D80","v":1}]
[null,null,{"$f":"CONCATENATE(A79,B81,B79)","v":"Actor 1: Estrategia 1"},null,{"$f":"IF(D79=F79,\"Indefinido\",IF(G83=F79,E78,C78))","v":"Estrategia 2"},null,{"$f":"MAX(F79,D79)","v":5},null,null,{"$f":"\"Estrategia 1\"&\"Estrategia 2\"","v":"Estrategia 1Estrategia 2"},{"$f":"E79","v":1},{"$f":"F79","v":5}]
[{"$f":"CONCATENATE(C77,$B$27,E83)","v":"Actor 2: Estrategia 2"},null,{"$f":"CONCATENATE(A79,B81,B80)","v":"Actor 1: Estrategia 2"},null,{"$f":"IF(D80=F80,\"Indefinido\",IF(G84=F80,E78,C78))","v":"Indefinido"},{"$f":"IF(E84=E83,E83,\"Indefinido\")","v":"Indefinido"},{"$f":"MAX(F80,D80)","v":1},{"$f":"IF(F84=F86,G84,G83)","v":1},null,{"$f":"\"Estrategia 2\"&\"Estrategia 2\"","v":"Estrategia 2Estrategia 2"},{"$f":"E80","v":2},{"$f":"F80","v":1}]
[{"$f":"CONCATENATE(C77,$B$27,E84)","v":"Actor 2: Indefinido"},null,{"$f":"CONCATENATE(C77,B81,C78)","v":"Actor 2: Estrategia 1"},null,{"$f":"IF(C79=C80,\"Indefinido\",IF(G85=C80,B80,B79))","v":"Indefinido"},null,{"$f":"MAX(C79:C80)","v":10},null,null,{"$f":"\"INDEFINIDO\"&\"Estrategia 1\"","v":"INDEFINIDOEstrategia 1"},"Indefinido","Indefinido"]
[{"$f":"CONCATENATE(A79,$B$27,E85)","v":"Actor 1: Indefinido"},null,{"$f":"CONCATENATE(C77,B81,E78)","v":"Actor 2: Estrategia 2"},null,{"$f":"IF(E79=E80,\"Indefinido\",IF(G86=E80,B80,B79))","v":"Estrategia 2"},{"$f":"IF(E86=E85,E85,\"Indefinido\")","v":"Indefinido"},{"$f":"MAX(E79:E80)","v":2},{"$f":"IF(F84=F86,G86,G85)","v":2},null,{"$f":"\"Estrategia 2\"&\"INDEFINIDO\"","v":"Estrategia 2INDEFINIDO"},"Indefinido","Indefinido"]
[{"$f":"CONCATENATE(A79,$B$27,E86)","v":"Actor 1: Estrategia 2"},{"$nulls":8},{"$f":"\"INDEFINIDO\"&\"INDEFINIDO\"","v":"INDEFINIDOINDEFINIDO"},"Indefinido","Indefinido"]
[null,null,"Resultado del juego",null,null,{"$f":"D90&D91","v":"IndefinidoIndefinido"},{"$nulls":3},{"$f":"\"INDEFINIDO\"&\"Estrategia 2\"","v":"INDEFINIDOEstrategia 2"},"Indefinido","Indefinido"]
[{"$nulls":3},"Acción ","Pago",{"$nulls":4},{"$f":"\"Estrategia 1\"&\"INDEFINIDO\"","v":"Estrategia 1INDEFINIDO"},"Indefinido","Indefinido"]
[null,null,{"$f":"A79","v":"Actor 1"},{"$f":"F86","v":"Indefinido"},{"$f":"VLOOKUP($F$88,$J$81:$L$89,2,0)","v":"Indefinido"}]
[null,null,{"$f":"C77","v":"Actor 2"},{"$f":"F84","v":"Indefinido"},{"$f":"VLOOKUP($F$88,$J$81:$L$89,3,0)","v":"Indefinido"}]
[]
[{"$nulls":4},"A1","A2",{"$nulls":3},"Actor 2","Actor 1"]
[null,null,"Actor 1",{"$f":"IF($F86=\"indefinido\",VLOOKUP($F84,$J$94:$N$96,3,0),\"error\")","v":"INDEFINIDO"},{"$f":"VLOOKUP($F$97,$J$81:$L$89,2,0)","v":"Indefinido"},{"$f":"VLOOKUP($F$97,$J$81:$L$89,3,0)","v":"Indefinido"},{"$nulls":3},"Estrategia 1",{"$f":"MAX(C79:C80)","v":10},{"$f":"IF(K94=C79,B79,B80)","v":"Estrategia 1"}]
[null,null,"Actor 2",{"$f":"IF(F84=\"indefinido\",VLOOKUP(F86,J99:N101,3,0),\"error\")","v":"INDEFINIDO"},{"$f":"VLOOKUP($F$98,$J$81:$L$89,2,0)","v":"Indefinido"},{"$f":"VLOOKUP($F$98,$J$81:$L$89,3,0)","v":"Indefinido"},{"$nulls":3},"Estrategia 2",{"$f":"MAX(E79:E80)","v":2},{"$f":"IF(K95=E79,B79,B80)","v":"Estrategia 2"}]
[{"$nulls":9},"INDEFINIDO","INDEFINIDO","INDEFINIDO"]
[{"$nulls":5},{"$f":"D94&F84","v":"INDEFINIDOIndefinido"}]
[{"$nulls":5},{"$f":"F86&D95","v":"IndefinidoINDEFINIDO"},{"$nulls":3},"Actor 1","Actor 2"]
[{"$nulls":9},"Estrategia 1",{"$f":"MAX(D79,F79)","v":5},{"$f":"IF(K99=D79,C78,E78)","v":"Estrategia 2"}]
[{"$nulls":4},"A1",{"$nulls":4},"Estrategia 2",{"$f":"MAX(D80,F80)","v":1},{"$f":"IF(K100=D80,C78,E78)","v":"Estrategia 1"}]
[null,null,"Actor 1",{"$f":"IF($F$86=\"INDEFINIDO\",$D$94,$D$90)","v":"INDEFINIDO"},{"$f":"VLOOKUP($D$104,$J$81:$L$89,2,0)","v":"Indefinido"},{"$nulls":4},"INDEFINIDO","INDEFINIDO","INDEFINIDO"]
[null,null,"Actor 2",{"$f":"IF($F$84=\"INDEFINIDO\",$D$95,$D$91)","v":"INDEFINIDO"},{"$f":"VLOOKUP($D$104,$J$81:$L$89,3,0)","v":"Indefinido"}]
[]
[{"$nulls":3},{"$f":"D101&D102","v":"INDEFINIDOINDEFINIDO"}]
[{"$nulls":6},"A1","A2"]
[null,null,{"$f":"IF(D104=\"INDEFINIDOINDEFINIDO\",MAX(C79:C80),\"BASURA\")","v":10},{"$f":"IF(C106=C79,B79,B80)","v":"Estrategia 1"},{"$f":"D106&\"Estrategia 1\"","v":"Estrategia 1Estrategia 1"},null,{"$f":"VLOOKUP($E$106,$J$81:$L$89,2,0)","v":10},{"$f":"VLOOKUP($E$106,$J$81:$L$89,3,0)","v":1},null,{"$f":"\"Estrategia 1\" & \"Estrategia 1\"","v":"Estrategia 1Estrategia 1"},{"$f":"E80","v":2},{"$f":"F80","v":1}]
[{"$nulls":6},{"$f":"VLOOKUP($E$106,$J$106:$L$107,2,0)","v":2},{"$f":"VLOOKUP($E$106,$J$106:$L$107,3,0)","v":1},null,{"$f":"\"Estrategia 2\" & \"Estrategia 2\"","v":"Estrategia 2Estrategia 2"},{"$f":"E79","v":1},{"$f":"F79","v":5}]
[null,null,"NIÑAS 1"]
[null,null,"Actor 1",{"$f":"D106","v":"Estrategia 1"},{"$f":"G106","v":10}]
[null,null,"Actor 2",{"$f":"\"Estrategia 1\"","v":"Estrategia 1"},{"$f":"H106","v":1}]
[]
[null,null,"NIÑAS 2"]
[null,null,"Actor 1",{"$f":"IF(D109=\"Estrategia 1\",\"Estrategia 2\",\"Estrategia 1\")","v":"Estrategia 2"},{"$f":"G107","v":2}]
[null,null,"Actor 2",{"$f":"\"Estrategia 2\"","v":"Estrategia 2"},{"$f":"H107","v":1}]
[{"$nulls":7},"Condiciòn Dominante"]
[null,null,{"$f":"IF(D104=\"INDEFINIDOINDEFINIDO\",\"NASH\",IF(H118=TRUE,\"Dominante\",\"Semidominante\"))","v":"NASH"},{"$nulls":4},{"$f":"E83=E84","v":false}]
[{"$nulls":7},{"$f":"E85=E86","v":false}]
[{"$nulls":7},{"$f":"H116=H117","v":true}]
[]
[null,"Resultado",null,"A2",null,null,"Resultado",null,"E2"]
[{"$nulls":3},{"$f":"IF(C116=\"nash\",D110,D102)","v":"Estrategia 1"},{"$nulls":4},{"$f":"IF(C116=\"NASH\",D114,\"No hay otro equilibrio\")","v":"Estrategia 2"}]
[null,"A1",{"$f":"IF(C116=\"nash\",D109,D101)","v":"Estrategia 1"},{"$f":"IF(C116=\"nash\",E109,E101)","v":10},{"$f":"IF(C116=\"nash\",E110,E102)","v":1},null,"E1",{"$f":"IF(C116=\"nash\",D113,\"No hay otro equilibrio\")","v":"Estrategia 2"},{"$f":"IF(C116=\"nash\",E113,\"No hay otro equilibrio\")","v":2},{"$f":"IF(C116=\"nash\",E114,\"No hay otro equilibrio\")","v":1}]

{"sheet":"Estrategia Maximin","index":5,"n_rows":25,"n_cols":21,"rows_kept":25,"hidden":true,"merged":[[1,1,1,20],[2,1,2,20],[5,2,5,3],[5,4,5,5],[5,6,5,7],[5,8,5,9],[5,10,5,11],[5,12,5,13],[5,14,5,15],[5,16,5,17],[5,18,5,19],[17,9,17,10],[17,11,17,12],[18,9,18,10],[18,11,18,12],[21,3,21,6],[22,3,22,6],[23,3,23,6],[24,3,24,6]]}
[]
[null,"TEORÍA DE JUEGOS"]
[null,"ESTRATEGIA MAXIMIN"]
[]
[]
[null,null,"B1",null,"B2",null,"B3",null,"B4",null,"B5",null,"B6",null,"B7",null,"B8",null,"B9",null,"Mínimo A"]
[null,"A1",10,6,10,10,{"$nulls":14},{"$f":"MIN(C7,E7,G7,I7,K7,M7,O7,Q7,S7)","v":10}]
[null,"A2",6,6,6,10,{"$nulls":14},{"$f":"MIN(C8,E8,G8,I8,K8,M8,O8,Q8,S8)","v":6}]
[null,"A3",{"$nulls":18},0]
[null,"A4",{"$nulls":18},0]
[null,"A4",{"$nulls":18},0]
[null,"A6",{"$nulls":18},0]
[null,"A7",{"$nulls":18},0]
[null,"A8",{"$nulls":18},0]
[null,"A9",{"$nulls":18},0]
[null,"Mínimo B",null,{"$f":"MIN(D7:D15)","v":6},null,{"$f":"MIN(F7:F15)","v":10},null,{"$f":"MIN(H7:H15)","v":0},null,{"$f":"MIN(J7:J15)","v":0},null,{"$f":"MIN(L7:L15)","v":0},null,{"$f":"MIN(N7:N15)","v":0},null,{"$f":"MIN(P7:P15)","v":0},null,{"$f":"MIN(R7:R15)","v":0},null,{"$f":"MIN(T7:T15)","v":0}]
[]
[{"$nulls":9},"Máximo A",null,"Máximo B"]
[{"$nulls":9},{"$f":"MAX(U7:U15)","v":10},null,{"$f":"MAX(C16:T16)","v":10}]
[]
[]
[{"$nulls":3},"Títulos"]
[{"$nulls":3},"Resultados"]
[{"$nulls":3},"Insertar datos"]
[{"$nulls":3},"Valores de equilibrio"]

{"sheet":"Hoja1","index":6,"n_rows":0,"n_cols":0,"rows_kept":0,"hidden":true}